In14Ge radical anion

Gas phase ion energetics data

Data compiled by: John E. Bartmess

Electron affinity of neutral species

EAneutral (eV) Method Reference Comment
2.260 ± 0.060LPESAkutsu, Koyasu, et al., 2007

References

Akutsu, Koyasu, et al., 2007
Akutsu, M.; Koyasu, K.; Atobe, J.; Miyajima, K.; Mitsui, M.; Nakajima, A., Electronic Properties of Si and Ge Atoms Doped In Clusters: InnSim and InnGem, J. Phys. Chem. A, 2007, 111, 4, 573-577., https://doi.org/10.1021/jp065921w . [all data]