MeO2CCH(NH2)(CH2)2CO2 anion

Reaction thermochemistry data

Data compiled by: John E. Bartmess

Individual Reactions

C6H10NO4- + Hydrogen cation = C6H11NO4

By formula: C6H10NO4- + H+ = C6H11NO4

Quantity Value Units Method Reference Comment
Δr1420. ± 13.kJ/molCIDCFournier, Afonso, et al., 2008gas phase
Quantity Value Units Method Reference Comment
Δr1395. ± 13.kJ/molCIDCFournier, Afonso, et al., 2008gas phase

References

Fournier, Afonso, et al., 2008
Fournier, F.; Afonso, C.; Fagin, A.E.; Gronert, S.; Tabet, J.C., Can Cluster Structure Affect Kinetic Method Measurements? The Curious Case of Glutamic Acid's Gas-Phase Acidity, J. Am. Soc. Mass Spectrom., 2008, 19, 12, 1887-1896, https://doi.org/10.1016/j.jasms.2008.07.022 . [all data]