CHF=C(CH2F)O anion
- Formula: C3H3F2O-
- Molecular weight: 93.0527

Reaction thermochemistry data

Data compiled by: John E. Bartmess
Individual Reactions
By formula: C3H3F2O- + H+ = C3H4F2O
Quantity | Value | Units | Method | Reference | Comment |
---|---|---|---|---|---|
ΔrH° | 1466. ± 13. | kJ/mol | G+TS | Farid and McMahon, 1980 | gas phase; Between PhCH2CN, CF3COCH3; value altered from reference due to change in acidity scale |
Quantity | Value | Units | Method | Reference | Comment |
ΔrG° | 1436. ± 13. | kJ/mol | IMRB | Farid and McMahon, 1980 | gas phase; Between PhCH2CN, CF3COCH3; value altered from reference due to change in acidity scale |

Gas phase ion energetics data

Data compiled by: John E. Bartmess
Protonation reactions
By formula: C3H3F2O- + H+ = C3H4F2O
Quantity | Value | Units | Method | Reference | Comment |
---|---|---|---|---|---|
ΔrH° | 1466. ± 13. | kJ/mol | G+TS | Farid and McMahon, 1980 | gas phase; Between PhCH2CN, CF3COCH3; value altered from reference due to change in acidity scale |
Quantity | Value | Units | Method | Reference | Comment |
ΔrG° | 1436. ± 13. | kJ/mol | IMRB | Farid and McMahon, 1980 | gas phase; Between PhCH2CN, CF3COCH3; value altered from reference due to change in acidity scale |

References

Farid and McMahon, 1980
Farid, R.; McMahon, T.B.,
The gas phase acidities of fluorinated acetones. An ICR investigation of the role of fluorine substituents in the stabilization of planar carbanions,
Can. J. Chem., 1980, 58, 2307. [all data]