N2O..Cl anion
- Formula: ClN2O-
- Molecular weight: 79.466

Gas phase thermochemistry data

Data compiled by: John E. Bartmess
Quantity | Value | Units | Method | Reference | Comment |
---|---|---|---|---|---|
ΔfH°gas | -164.6 | kJ/mol | Ther | Boesl, Distelrath, et al., 2008 |

Reaction thermochemistry data

Data compiled by: John E. Bartmess
Individual Reactions
By formula: Cl- = ClN2O-
Quantity | Value | Units | Method | Reference | Comment |
---|---|---|---|---|---|
ΔrH° | 18.8 ± 0.42 | kJ/mol | N/A | Boesl, Distelrath, et al., 2008 | gas phase |

Gas phase ion energetics data

Data compiled by: John E. Bartmess
Electron affinity of neutral species
EAneutral (eV) | Method | Reference | Comment |
---|---|---|---|
3.8070 ± 0.0010 | LPES | Boesl, Distelrath, et al., 2008 |

Ion clustering data

Data compiled by: John E. Bartmess
Clustering reactions
By formula: Cl- = ClN2O-
Quantity | Value | Units | Method | Reference | Comment |
---|---|---|---|---|---|
ΔrH° | 18.8 ± 0.42 | kJ/mol | N/A | Boesl, Distelrath, et al., 2008 | gas phase |

References

Boesl, Distelrath, et al., 2008
Boesl, U.; Distelrath, V.; Selzle, H.,
The weakly-bound complex Cl center dot N2O studied by high resolution photodetachment photoelectron spectroscopy,
Phys. Chem. Chem. Phys., 2008, 10, 41, 6252-6257, https://doi.org/10.1039/b807992g
. [all data]