Co(pyrene) radical anion

Gas phase ion energetics data

Data compiled by: John E. Bartmess

Electron affinity of neutral species

EAneutral (eV) Method Reference Comment
0.930 ± 0.050LPESKandalam, Jena, et al., 2008Vertical Detachment Energy: 1.11±0.05 eV

References

Kandalam, Jena, et al., 2008
Kandalam, A.K.; Jena, P.; Li, X.; Eustis, S.N.; Bowen, K.H., Photoelectron spectroscopy and theoretical studies of [Co-m(pyrene)(n)](-) (m=1,2 and n=1,2) complexes, J. Chem. Phys., 2008, 129, 13, 134308, https://doi.org/10.1063/1.2982786 . [all data]