MeCOCF3..Cl anion
- Formula: C3H3ClF3O-
- Molecular weight: 147.504

Reaction thermochemistry data

Data compiled by: John E. Bartmess
Individual Reactions
By formula: Cl- + C3H3F3O = C3H3ClF3O-
Quantity | Value | Units | Method | Reference | Comment |
---|---|---|---|---|---|
ΔrH° | 57.3 ± 4.2 | kJ/mol | TDAs | Bofdanov and McMahon, 2002 | gas phase |
Quantity | Value | Units | Method | Reference | Comment |
ΔrG° | 34. ± 4.2 | kJ/mol | TDAs | Bofdanov and McMahon, 2002 | gas phase |

Ion clustering data

Data compiled by: John E. Bartmess
Clustering reactions
By formula: Cl- + C3H3F3O = C3H3ClF3O-
Quantity | Value | Units | Method | Reference | Comment |
---|---|---|---|---|---|
ΔrH° | 57.3 ± 4.2 | kJ/mol | TDAs | Bofdanov and McMahon, 2002 | gas phase |
Quantity | Value | Units | Method | Reference | Comment |
ΔrG° | 34. ± 4.2 | kJ/mol | TDAs | Bofdanov and McMahon, 2002 | gas phase |

Gas phase thermochemistry data

Data compiled by: John E. Bartmess

Quantity Value Units Method Reference Comment
Δfgas-1119.8kJ/molTherBofdanov and McMahon, 2002

References

Bofdanov and McMahon, 2002
Bofdanov, B.; McMahon, T.B.,
Structures, Thermochemistry, and Infrared Spectra of Chloride Ion-Fluorinated Acetone Complexes and Neutral Fluorinated Acetones in the Gas Phase: Experiment and Theory,
Int. J. Mass Spectrom., 2002, 219, 3, 593-613, https://doi.org/10.1016/S1387-3806(02)00745-5
. [all data]