CH2=C(CH2F)O anion
- Formula: C3H4FO-
- Molecular weight: 75.0622

Gas phase ion energetics data

Data compiled by: John E. Bartmess
Electron affinity of neutral species
EAneutral (eV) | Method | Reference | Comment |
---|---|---|---|
1.89 ± 0.20 | D-EA | Clair and McMahon, 1980 | value altered from reference due to change in acidity scale |
Protonation reactions
By formula: C3H4FO- + H+ = C3H5FO
Quantity | Value | Units | Method | Reference | Comment |
---|---|---|---|---|---|
ΔrH° | 1532. ± 17. | kJ/mol | G+TS | Clair and McMahon, 1980 | gas phase; value altered from reference due to change in acidity scale |
Quantity | Value | Units | Method | Reference | Comment |
ΔrG° | 1503. ± 17. | kJ/mol | IMRB | Clair and McMahon, 1980 | gas phase; value altered from reference due to change in acidity scale |

Reaction thermochemistry data

Data compiled by: John E. Bartmess

Individual Reactions

C3H4FO- + Hydrogen cation = 2-Propanone, 1-fluoro-

By formula: C3H4FO- + H+ = C3H5FO

Quantity Value Units Method Reference Comment
Δr366.1 ± 4.1kcal/molG+TSClair and McMahon, 1980gas phase; value altered from reference due to change in acidity scale
Quantity Value Units Method Reference Comment
Δr359.3 ± 4.0kcal/molIMRBClair and McMahon, 1980gas phase; value altered from reference due to change in acidity scale

References

Clair and McMahon, 1980
Clair, R.L.; McMahon, T.B.,
An ion cyclotron resonance study of base-induced elimination reactions of fluorinated alcohols and unimolecular loss of HF from chemically activated fluoroalkoxide ions,
Int. J. Mass Spectrom. Ion Phys., 1980, 33, 21. [all data]