TaO2 anion

Gas phase ion energetics data

Data compiled by: John E. Bartmess

Electron affinity of neutral species

EAneutral (eV) Method Reference Comment
2.400 ± 0.060LPESZheng, Li, et al., 2008

Gas phase thermochemistry data

Data compiled by: John E. Bartmess

Quantity Value Units Method Reference Comment
Δfgas-404. ± 10.kJ/molR-EAZheng, Li, et al., 2008

References

Zheng, Li, et al., 2008
Zheng, W.J.; Li, X.; Eustis, S.; Bowen, K., Anion photoelectron spectroscopy of TaOn- (n=1-3), Chem. Phys. Lett., 2008, 460, 1-3, 68-71, https://doi.org/10.1016/j.cplett.2008.06.016 . [all data]