cyclobutanone enolate anion

Reaction thermochemistry data

Data compiled by: John E. Bartmess

Individual Reactions

C4H5O- + Hydrogen cation = Cyclobutanone

By formula: C4H5O- + H+ = C4H6O

Quantity Value Units Method Reference Comment
Δr1536. ± 17.kJ/molG+TSBrickhouse and Squires, 1988gas phase; Between Me2C=NOH, EtCHO
Quantity Value Units Method Reference Comment
Δr1502. ± 17.kJ/molIMRBBrickhouse and Squires, 1988gas phase; Between Me2C=NOH, EtCHO

References

Brickhouse and Squires, 1988
Brickhouse, M.D.; Squires, R.R., Gas Phase Bronsted vs. Lewis Acid-Base Reactions of 6,6-Dimethylfulvene. A Sensitive Probe of the Electronic Structures of Organic Anions, J. Am. Chem. Soc., 1988, 110, 9, 2706, https://doi.org/10.1021/ja00217a002 . [all data]