CD2=CDO anion

Gas phase ion energetics data

Data compiled by: John E. Bartmess

Electron affinity of neutral species

EAneutral (eV) Method Reference Comment
1.817 ± 0.029LPESEllison, Engleking, et al., 1982

References

Ellison, Engleking, et al., 1982
Ellison, G.B.; Engleking, P.C.; Lineberger, W.C., Photoelectron spectroscopy of alkoxide and enolate negative ions, J. Phys. Chem., 1982, 86, 4873. [all data]