CS2..S2 anion
- Formula: CS4-
- Molecular weight: 140.271

Gas phase thermochemistry data

Data compiled by: John E. Bartmess
Quantity | Value | Units | Method | Reference | Comment |
---|---|---|---|---|---|
ΔfH°gas | 4. ± 23. | kJ/mol | Ther | Hiraoka, Fujimaki, et al., 1994 |

Ion clustering data

Data compiled by: John E. Bartmess
Clustering reactions
CS4- = C2S6-
By formula: CS4- = C2S6-
Quantity | Value | Units | Method | Reference | Comment |
---|---|---|---|---|---|
ΔrH° | 26. ± 6.3 | kJ/mol | TDAs | Hiraoka, Fujimaki, et al., 1994 | gas phase; Entropy estimated |
S2- = CS4-
By formula: S2- = CS4-
Quantity | Value | Units | Method | Reference | Comment |
---|---|---|---|---|---|
ΔrH° | 79.9 ± 6.3 | kJ/mol | TDAs | Hiraoka, Fujimaki, et al., 1994 | gas phase |

References

Hiraoka, Fujimaki, et al., 1994
Hiraoka, K.; Fujimaki, S.; Aruga, K.,
Frontier-controlled Structures of the Gas Phas Clusters A+/-(CS2)n, A+/- = S2+, CS2+, S2-, and CS2-,
J. Phys. Chem. (1994), 1994, 98, 7, 1802-1809, https://doi.org/10.1021/j100058a014
. [all data]