H2NCON=C(Me)O anion
- Formula: C3H5N2O2-
- Molecular weight: 101.0845

Reaction thermochemistry data

Data compiled by: John E. Bartmess
Individual Reactions
By formula: C3H5N2O2- + H+ = C3H6N2O2
Quantity | Value | Units | Method | Reference | Comment |
---|---|---|---|---|---|
ΔrH° | 348.5 ± 2.9 | kcal/mol | G+TS | Cumming and Kebarle, 1978 | gas phase; Acid: acetylurea |
Quantity | Value | Units | Method | Reference | Comment |
ΔrG° | 341.1 ± 2.0 | kcal/mol | IMRE | Cumming and Kebarle, 1978 | gas phase; Acid: acetylurea |

Gas phase ion energetics data

Data compiled by: John E. Bartmess
Protonation reactions
By formula: C3H5N2O2- + H+ = C3H6N2O2
Quantity | Value | Units | Method | Reference | Comment |
---|---|---|---|---|---|
ΔrH° | 348.5 ± 2.9 | kcal/mol | G+TS | Cumming and Kebarle, 1978 | gas phase; Acid: acetylurea |
Quantity | Value | Units | Method | Reference | Comment |
ΔrG° | 341.1 ± 2.0 | kcal/mol | IMRE | Cumming and Kebarle, 1978 | gas phase; Acid: acetylurea |

References

Cumming and Kebarle, 1978
Cumming, J.B.; Kebarle, P.,
Summary of gas phase measurements involving acids AH. Entropy changes in proton transfer reactions involving negative ions. Bond dissociation energies D(A-H) and electron affinities EA(A),
Can. J. Chem., 1978, 56, 1. [all data]