cC5F8..F anion

Ion clustering data

Data compiled by: John E. Bartmess

Clustering reactions

C5F9- + 2Cyclopentene, octafluoro- = C10F17-

By formula: C5F9- + 2C5F8 = C10F17-

Quantity Value Units Method Reference Comment
Δr28.0 ± 1.3kJ/molTDAsHiraoka, Fujita, et al., 1905gas phase
Quantity Value Units Method Reference Comment
Δr4.4 ± 1.3kJ/molTDAsHiraoka, Fujita, et al., 1905gas phase

Fluorine anion + Cyclopentene, octafluoro- = C5F9-

By formula: F- + C5F8 = C5F9-

Quantity Value Units Method Reference Comment
Δr>125.5kJ/molTDAsHiraoka, Fujita, et al., 1905gas phase

References

Hiraoka, Fujita, et al., 1905
Hiraoka, K.; Fujita, K.; Ishida, M.; Ichikawa, T.; Okada, H.; Hiizumi, K.; Wada, A.; Takao, K.; Yamabe, S.; Tsuchida, N., Gas-phase Ion/Molecule Reactions in C5F8, J. Phys. Chem. A (2005), 1905, 109, 6, 1049-1056., https://doi.org/10.1021/jp040251k . [all data]