(CF2=CF2)2..Br anion
- Formula: C4BrF8-
- Molecular weight: 279.935

Reaction thermochemistry data

Data compiled by: John E. Bartmess
Individual Reactions
C2BrF4- + 2 = C4BrF8-
By formula: C2BrF4- + 2C2F4 = C4BrF8-
Quantity | Value | Units | Method | Reference | Comment |
---|---|---|---|---|---|
ΔrH° | 25.1 ± 2.1 | kJ/mol | TDAs | Hiraoka, Mochizuki, et al., 2008 | gas phase |
Quantity | Value | Units | Method | Reference | Comment |
ΔrG° | 3.9 ± 2.1 | kJ/mol | TDAs | Hiraoka, Mochizuki, et al., 2008 | gas phase |

Ion clustering data

Data compiled by: John E. Bartmess
Clustering reactions
C2BrF4- + 2 = C4BrF8-
By formula: C2BrF4- + 2C2F4 = C4BrF8-
Quantity | Value | Units | Method | Reference | Comment |
---|---|---|---|---|---|
ΔrH° | 25.1 ± 2.1 | kJ/mol | TDAs | Hiraoka, Mochizuki, et al., 2008 | gas phase |
Quantity | Value | Units | Method | Reference | Comment |
ΔrG° | 3.9 ± 2.1 | kJ/mol | TDAs | Hiraoka, Mochizuki, et al., 2008 | gas phase |

References

Hiraoka, Mochizuki, et al., 2008
Hiraoka, K.; Mochizuki, N.; Wada, A.; Okada, H.; Ichikawa, T.; Asakawa, D.; Yazawa, I.,
Gas-phase ion/molecule reactions in C2F4,
Int. J. Mass Spectrom., 2008, 272, 1, 22-28, https://doi.org/10.1016/j.ijms.2007.12.013
. [all data]