(CF2=CF2)3..Cl anion
- Formula: C6ClF12-
- Molecular weight: 335.499

Reaction thermochemistry data

Data compiled by: John E. Bartmess
Individual Reactions
C4ClF8- + 3 = C6ClF12-
By formula: C4ClF8- + 3C2F4 = C6ClF12-
Quantity | Value | Units | Method | Reference | Comment |
---|---|---|---|---|---|
ΔrH° | 6.30 ± 0.50 | kcal/mol | TDAs | Hiraoka, Mochizuki, et al., 2008 | gas phase |
Quantity | Value | Units | Method | Reference | Comment |
ΔrG° | 0.64 ± 0.50 | kcal/mol | TDAs | Hiraoka, Mochizuki, et al., 2008 | gas phase |
C6ClF12- + 4 = C8ClF16-
By formula: C6ClF12- + 4C2F4 = C8ClF16-
Quantity | Value | Units | Method | Reference | Comment |
---|---|---|---|---|---|
ΔrH° | 6.00 ± 0.50 | kcal/mol | TDAs | Hiraoka, Mochizuki, et al., 2008 | gas phase |
Quantity | Value | Units | Method | Reference | Comment |
ΔrG° | 0.04 ± 0.50 | kcal/mol | TDAs | Hiraoka, Mochizuki, et al., 2008 | gas phase |

Ion clustering data

Data compiled by: John E. Bartmess
Clustering reactions
C4ClF8- + 3 = C6ClF12-
By formula: C4ClF8- + 3C2F4 = C6ClF12-
Quantity | Value | Units | Method | Reference | Comment |
---|---|---|---|---|---|
ΔrH° | 6.30 ± 0.50 | kcal/mol | TDAs | Hiraoka, Mochizuki, et al., 2008 | gas phase |
Quantity | Value | Units | Method | Reference | Comment |
ΔrG° | 0.64 ± 0.50 | kcal/mol | TDAs | Hiraoka, Mochizuki, et al., 2008 | gas phase |
C6ClF12- + 4 = C8ClF16-
By formula: C6ClF12- + 4C2F4 = C8ClF16-
Quantity | Value | Units | Method | Reference | Comment |
---|---|---|---|---|---|
ΔrH° | 6.00 ± 0.50 | kcal/mol | TDAs | Hiraoka, Mochizuki, et al., 2008 | gas phase |
Quantity | Value | Units | Method | Reference | Comment |
ΔrG° | 0.04 ± 0.50 | kcal/mol | TDAs | Hiraoka, Mochizuki, et al., 2008 | gas phase |

References

Hiraoka, Mochizuki, et al., 2008
Hiraoka, K.; Mochizuki, N.; Wada, A.; Okada, H.; Ichikawa, T.; Asakawa, D.; Yazawa, I.,
Gas-phase ion/molecule reactions in C2F4,
Int. J. Mass Spectrom., 2008, 272, 1, 22-28, https://doi.org/10.1016/j.ijms.2007.12.013
. [all data]