V8O20 anion

Gas phase ion energetics data

Data compiled by: John E. Bartmess

Electron affinity of neutral species

EAneutral (eV) Method Reference Comment
4.450 ± 0.050LPESZhai, Dobler, et al., 2007Vertical Detachment Energy: 5.06±0.10 eV

References

Zhai, Dobler, et al., 2007
Zhai, H.J.; Dobler, J.; Sauer, J.; Wang, L.S., Probing the electronic structure of early transition-metal oxide clusters: Polyhedral cages of (V2O5)(n)(-) (n = 2-4) and (M2O5)(2)(-) (M = Nb, Ta), J. Am. Chem. Soc., 2007, 129, 43, 13270-13276, https://doi.org/10.1021/ja0750874 . [all data]