(Xe)2..F anion
- Formula: FXe2-
- Molecular weight: 281.585

Gas phase thermochemistry data

Data compiled by: John E. Bartmess
Quantity | Value | Units | Method | Reference | Comment |
---|---|---|---|---|---|
ΔfH°gas | -70.97 ± 0.43 | kcal/mol | Ther | Wada, Kikkawa, et al., 2007 |

Reaction thermochemistry data

Data compiled by: John E. Bartmess
Individual Reactions
FXe2- + 3 = FXe3-
By formula: FXe2- + 3Xe = FXe3-
Quantity | Value | Units | Method | Reference | Comment |
---|---|---|---|---|---|
ΔrH° | 5.00 ± 0.40 | kcal/mol | TDAs | Wada, Kikkawa, et al., 2007 | gas phase |
Quantity | Value | Units | Method | Reference | Comment |
ΔrG° | -0.66 ± 0.40 | kcal/mol | TDAs | Wada, Kikkawa, et al., 2007 | gas phase |
FXe- + 2 = FXe2-
By formula: FXe- + 2Xe = FXe2-
Quantity | Value | Units | Method | Reference | Comment |
---|---|---|---|---|---|
ΔrH° | 5.20 ± 0.30 | kcal/mol | TDAs | Wada, Kikkawa, et al., 2007 | gas phase |
Quantity | Value | Units | Method | Reference | Comment |
ΔrG° | 0.13 ± 0.30 | kcal/mol | TDAs | Wada, Kikkawa, et al., 2007 | gas phase |

Ion clustering data

Data compiled by: John E. Bartmess
Clustering reactions
FXe- + 2 = FXe2-
By formula: FXe- + 2Xe = FXe2-
Quantity | Value | Units | Method | Reference | Comment |
---|---|---|---|---|---|
ΔrH° | 5.20 ± 0.30 | kcal/mol | TDAs | Wada, Kikkawa, et al., 2007 | gas phase |
Quantity | Value | Units | Method | Reference | Comment |
ΔrG° | 0.13 ± 0.30 | kcal/mol | TDAs | Wada, Kikkawa, et al., 2007 | gas phase |
FXe2- + 3 = FXe3-
By formula: FXe2- + 3Xe = FXe3-
Quantity | Value | Units | Method | Reference | Comment |
---|---|---|---|---|---|
ΔrH° | 5.00 ± 0.40 | kcal/mol | TDAs | Wada, Kikkawa, et al., 2007 | gas phase |
Quantity | Value | Units | Method | Reference | Comment |
ΔrG° | -0.66 ± 0.40 | kcal/mol | TDAs | Wada, Kikkawa, et al., 2007 | gas phase |

References

Wada, Kikkawa, et al., 2007
Wada, A.; Kikkawa, A.; Sugiyama, T.; Hiraoka, K.,
Thermochemical Stabilities of the Gas-phase Cluster Ions of Halide Ions with Rare Gas Atoms,
Int. J. Mass Spectrom.., 2007, 267, 1-3, 284-287, https://doi.org/10.1016/j.ijms.2007.02.053
. [all data]