mSCF3-anilide anion
- Formula: C7H5F3NS-
- Molecular weight: 192.182

Gas phase ion energetics data

Data compiled by: John E. Bartmess
Electron affinity of neutral species
EAneutral (eV) | Method | Reference | Comment |
---|---|---|---|
2.13 ± 0.13 | D-EA | Taft and Topsom, 1987 |
Protonation reactions
C7H5F3NS- + = C7H6F3NS
By formula: C7H5F3NS- + H+ = C7H6F3NS
Quantity | Value | Units | Method | Reference | Comment |
---|---|---|---|---|---|
ΔrH° | 355.3 ± 2.1 | kcal/mol | G+TS | Taft and Topsom, 1987 | gas phase |
Quantity | Value | Units | Method | Reference | Comment |
ΔrG° | 348.0 ± 2.0 | kcal/mol | IMRE | Taft and Topsom, 1987 | gas phase |

Reaction thermochemistry data

Data compiled by: John E. Bartmess

Individual Reactions

C7H5F3NS- + Hydrogen cation = C7H6F3NS

By formula: C7H5F3NS- + H+ = C7H6F3NS

Quantity Value Units Method Reference Comment
Δr355.3 ± 2.1kcal/molG+TSTaft and Topsom, 1987gas phase
Quantity Value Units Method Reference Comment
Δr348.0 ± 2.0kcal/molIMRETaft and Topsom, 1987gas phase

References

Taft and Topsom, 1987
Taft, R.W.; Topsom, R.D.,
The Nature and Analysis of Substituent Effects,
Prog. Phys. Org. Chem., 1987, 16, 1. [all data]