mNO2-anilide anion
- Formula: C6H5N2O2-
- Molecular weight: 137.1166

Gas phase ion energetics data

Data compiled by: John E. Bartmess
Electron affinity of neutral species
EAneutral (eV) | Method | Reference | Comment |
---|---|---|---|
2.34 ± 0.13 | D-EA | Taft and Topsom, 1987 |
Protonation reactions
By formula: C6H5N2O2- + H+ = C6H6N2O2
Quantity | Value | Units | Method | Reference | Comment |
---|---|---|---|---|---|
ΔrH° | 352.3 ± 2.1 | kcal/mol | G+TS | Taft and Topsom, 1987 | gas phase |
Quantity | Value | Units | Method | Reference | Comment |
ΔrG° | 345.0 ± 2.0 | kcal/mol | IMRE | Taft and Topsom, 1987 | gas phase |

Reaction thermochemistry data

Data compiled by: John E. Bartmess

Individual Reactions

C6H5N2O2- + Hydrogen cation = m-Nitroaniline

By formula: C6H5N2O2- + H+ = C6H6N2O2

Quantity Value Units Method Reference Comment
Δr1474. ± 8.8kJ/molG+TSTaft and Topsom, 1987gas phase
Quantity Value Units Method Reference Comment
Δr1443. ± 8.4kJ/molIMRETaft and Topsom, 1987gas phase

References

Taft and Topsom, 1987
Taft, R.W.; Topsom, R.D.,
The Nature and Analysis of Substituent Effects,
Prog. Phys. Org. Chem., 1987, 16, 1. [all data]