mSO2Me-anilide anion
- Formula: C7H8NO2S-
- Molecular weight: 170.209

Reaction thermochemistry data

Data compiled by: John E. Bartmess
Individual Reactions
C7H8NO2S- + = C7H9NO2S
By formula: C7H8NO2S- + H+ = C7H9NO2S
Quantity | Value | Units | Method | Reference | Comment |
---|---|---|---|---|---|
ΔrH° | 352.6 ± 2.1 | kcal/mol | G+TS | Taft and Topsom, 1987 | gas phase |
Quantity | Value | Units | Method | Reference | Comment |
ΔrG° | 345.3 ± 2.0 | kcal/mol | IMRE | Taft and Topsom, 1987 | gas phase |

Gas phase ion energetics data

Data compiled by: John E. Bartmess
Electron affinity of neutral species
EAneutral (eV) | Method | Reference | Comment |
---|---|---|---|
2.33 ± 0.13 | D-EA | Taft and Topsom, 1987 |
Protonation reactions
C7H8NO2S- + = C7H9NO2S
By formula: C7H8NO2S- + H+ = C7H9NO2S
Quantity | Value | Units | Method | Reference | Comment |
---|---|---|---|---|---|
ΔrH° | 352.6 ± 2.1 | kcal/mol | G+TS | Taft and Topsom, 1987 | gas phase |
Quantity | Value | Units | Method | Reference | Comment |
ΔrG° | 345.3 ± 2.0 | kcal/mol | IMRE | Taft and Topsom, 1987 | gas phase |

References

Taft and Topsom, 1987
Taft, R.W.; Topsom, R.D.,
The Nature and Analysis of Substituent Effects,
Prog. Phys. Org. Chem., 1987, 16, 1. [all data]