(TiO2)7 radical anion

Gas phase ion energetics data

Data compiled by: John E. Bartmess

Electron affinity of neutral species

EAneutral (eV) Method Reference Comment
2.060 ± 0.050LPESZhai and Wang, 2007Vertical Detachment Energy: 4.20±0.15 eV

References

Zhai and Wang, 2007
Zhai, H.J.; Wang, L.S., Probing the electronic structure and band gap evolution of titanium oxide clusters (TiO2)(n)(-) (n=1-10) using photoelectron spectroscopy, J. Am. Chem. Soc., 2007, 129, 10, 3022-3026, https://doi.org/10.1021/ja068601z . [all data]