1,5-diaminonaphthalenide anion
- Formula: C10H9N2-
- Molecular weight: 157.1924
- IUPAC Standard InChIKey: HLTUSWVCKNOLDR-UHFFFAOYSA-N
- Chemical structure:
View 3d structure (requires JavaScript / HTML 5) - Permanent link for this species. Use this link for bookmarking this species for future reference.

Reaction thermochemistry data

Data compiled by: John E. Bartmess
Individual Reactions
By formula: C10H9N2- + H+ = C10H10N2
Quantity | Value | Units | Method | Reference | Comment |
---|---|---|---|---|---|
ΔrH° | 1493. ± 8.8 | kJ/mol | G+TS | Arnett, Venkatasubaramanian, et al., 1982 | gas phase; value altered from reference due to change in acidity scale |
Quantity | Value | Units | Method | Reference | Comment |
ΔrG° | 1463. ± 8.4 | kJ/mol | IMRE | Arnett, Venkatasubaramanian, et al., 1982 | gas phase; value altered from reference due to change in acidity scale |

Gas phase ion energetics data

Data compiled by: John E. Bartmess
Protonation reactions
By formula: C10H9N2- + H+ = C10H10N2
Quantity | Value | Units | Method | Reference | Comment |
---|---|---|---|---|---|
ΔrH° | 1493. ± 8.8 | kJ/mol | G+TS | Arnett, Venkatasubaramanian, et al., 1982 | gas phase; value altered from reference due to change in acidity scale |
Quantity | Value | Units | Method | Reference | Comment |
ΔrG° | 1463. ± 8.4 | kJ/mol | IMRE | Arnett, Venkatasubaramanian, et al., 1982 | gas phase; value altered from reference due to change in acidity scale |

References

Arnett, Venkatasubaramanian, et al., 1982
Arnett, E.M.; Venkatasubaramanian, K.G.; McIver, R.T.; Fukuda, E.K.; Bordwell, F.G.; Press, F.D.,
Stabilization of the monoanion of 1,8-diaminonaphthalene by intramolecular hydrogen bonding. A novel case of anion homoconjugation in superbase solution,
J. Am. Chem. Soc., 1982, 104, 325. [all data]