1,3,5-Triphenylbenzene radical anion

Gas phase ion energetics data

Data compiled by: John E. Bartmess

Electron affinity of neutral species

EAneutral (eV) Method Reference Comment
0.300 ± 0.020LPESNakamura, Ando, et al., 2006

References

Nakamura, Ando, et al., 2006
Nakamura, T.; Ando, N.; Matsumoto, Y.; Furuse, S.; Mitsui, M.; Nakajima, A., Adiabatic electron affinities of oligophenyls: Anion photoelectron spectroscopy and density functional theory study, Chem. Lett., 2006, 35, 8, 888-889, https://doi.org/10.1246/cl.2006.888 . [all data]