(H2O)5..Me2CO radical anion

Gas phase ion energetics data

Data compiled by: John E. Bartmess

Electron affinity of neutral species

EAneutral (eV) Method Reference Comment
1.740 ± 0.030LPESNakanishi, Muraoka, et al., 2006Stated electron affinity is the Vertical Detachment Energy

References

Nakanishi, Muraoka, et al., 2006
Nakanishi, R.; Muraoka, A.; Nagata, T., Photoelectron spectroscopy of acetone cluster anions, [(CH3)(2)CO]n (n=2,5-15), Chem. Phys. Lett., 2006, 427, 1-3, 56-61, https://doi.org/10.1016/j.cplett.2006.06.061 . [all data]