pCOMe-anilide anion
- Formula: C8H8NO-
- Molecular weight: 134.1558

Gas phase ion energetics data

Data compiled by: John E. Bartmess
Protonation reactions
By formula: C8H8NO- + H+ = C8H9NO
Quantity | Value | Units | Method | Reference | Comment |
---|---|---|---|---|---|
ΔrH° | 351.3 ± 2.1 | kcal/mol | G+TS | Taft and Topsom, 1987 | gas phase; value altered from reference due to change in acidity scale |
Quantity | Value | Units | Method | Reference | Comment |
ΔrG° | 344.0 ± 2.0 | kcal/mol | IMRE | Taft and Topsom, 1987 | gas phase; value altered from reference due to change in acidity scale |

Reaction thermochemistry data

Data compiled by: John E. Bartmess

Individual Reactions

C8H8NO- + Hydrogen cation = Acetophenone, 4'-amino-

By formula: C8H8NO- + H+ = C8H9NO

Quantity Value Units Method Reference Comment
Δr1470. ± 8.8kJ/molG+TSTaft and Topsom, 1987gas phase; value altered from reference due to change in acidity scale
Quantity Value Units Method Reference Comment
Δr1439. ± 8.4kJ/molIMRETaft and Topsom, 1987gas phase; value altered from reference due to change in acidity scale

References

Taft and Topsom, 1987
Taft, R.W.; Topsom, R.D.,
The Nature and Analysis of Substituent Effects,
Prog. Phys. Org. Chem., 1987, 16, 1. [all data]