5,6-diMe-uracilide(N3) anion
- Formula: C6H7N2O2-
- Molecular weight: 139.1325

Gas phase ion energetics data

Data compiled by: John E. Bartmess
Protonation reactions
By formula: C6H7N2O2- + H+ = C6H8N2O2
Quantity | Value | Units | Method | Reference | Comment |
---|---|---|---|---|---|
ΔrH° | 349.0 ± 3.0 | kcal/mol | IMRB | Lee, 2005 | gas phase |

References

Lee, 2005
Lee, J.K.,
Insights into nucleic acid reactivity through gas-phase experimental and computational studies,
Int. J. Mass Spectrom., 2005, 240, 3, 261-272, https://doi.org/10.1016/j.ijms.2004.09.020
. [all data]