Cl3PO..Cl anion
- Formula: Cl4OP-
- Molecular weight: 188.786

Reaction thermochemistry data

Data compiled by: John E. Bartmess
Individual Reactions
By formula: Cl- + Cl3OP = Cl4OP-
Quantity | Value | Units | Method | Reference | Comment |
---|---|---|---|---|---|
ΔrH° | 10.3 ± 1.2 | kcal/mol | CIDT | Check, Lobring, et al., 2003 | gas phase |

Ion clustering data

Data compiled by: John E. Bartmess
Clustering reactions
By formula: Cl- + Cl3OP = Cl4OP-
Quantity | Value | Units | Method | Reference | Comment |
---|---|---|---|---|---|
ΔrH° | 10.3 ± 1.2 | kcal/mol | CIDT | Check, Lobring, et al., 2003 | gas phase |

Gas phase thermochemistry data

Data compiled by: John E. Bartmess
Quantity | Value | Units | Method | Reference | Comment |
---|---|---|---|---|---|
ΔfH°gas | -200.46 | kcal/mol | Ther | Check, Lobring, et al., 2003 |

References

Check, Lobring, et al., 2003
Check, C.E.; Lobring, K.C.; Keating, P.R.; Gilbert, T.M.; Sunderlin, L.S.,
Effect of substituents on the strength of hypervalent phosphorus-halogen bonds,
J. Phys. Chem. A, 2003, 107, 42, 8961-8967, https://doi.org/10.1021/jp030287x
. [all data]