CF3H..iPrO anion
- Formula: C4H8F3O-
- Molecular weight: 129.1015

Reaction thermochemistry data

Data compiled by: John E. Bartmess
Individual Reactions
C3H7O- + = C4H8F3O-
By formula: C3H7O- + CHF3 = C4H8F3O-
Quantity | Value | Units | Method | Reference | Comment |
---|---|---|---|---|---|
ΔrH° | 88.3 ± 4.2 | kJ/mol | IMRE | Chabinyc and Brauman, 1998 | gas phase |
Quantity | Value | Units | Method | Reference | Comment |
ΔrG° | 59.4 ± 4.2 | kJ/mol | IMRE | Chabinyc and Brauman, 1998 | gas phase |

Ion clustering data

Data compiled by: John E. Bartmess
Clustering reactions
C3H7O- + = C4H8F3O-
By formula: C3H7O- + CHF3 = C4H8F3O-
Quantity | Value | Units | Method | Reference | Comment |
---|---|---|---|---|---|
ΔrH° | 88.3 ± 4.2 | kJ/mol | IMRE | Chabinyc and Brauman, 1998 | gas phase |
Quantity | Value | Units | Method | Reference | Comment |
ΔrG° | 59.4 ± 4.2 | kJ/mol | IMRE | Chabinyc and Brauman, 1998 | gas phase |

Gas phase thermochemistry data

Data compiled by: John E. Bartmess
Quantity | Value | Units | Method | Reference | Comment |
---|---|---|---|---|---|
ΔfH°gas | -1015. ± 6.3 | kJ/mol | Ther | Chabinyc and Brauman, 1998 |

References

Chabinyc and Brauman, 1998
Chabinyc, M.L.; Brauman, J.I.,
Acidity, basicity, and the stability of hydrogen bonds: Complexes of RO-+HCF3,
J. Am. Chem. Soc., 1998, 120, 42, 10863-10870, https://doi.org/10.1021/ja9817592
. [all data]