CF3H..EtO anion
- Formula: C3H6F3O-
- Molecular weight: 115.0749

Reaction thermochemistry data

Data compiled by: John E. Bartmess
Individual Reactions
C2H5O- + = C3H6F3O-
By formula: C2H5O- + CHF3 = C3H6F3O-
Quantity | Value | Units | Method | Reference | Comment |
---|---|---|---|---|---|
ΔrH° | 92.0 ± 4.2 | kJ/mol | IMRE | Chabinyc and Brauman, 1998 | gas phase |
Quantity | Value | Units | Method | Reference | Comment |
ΔrG° | 63.2 ± 4.2 | kJ/mol | IMRE | Chabinyc and Brauman, 1998 | gas phase |

Ion clustering data

Data compiled by: John E. Bartmess
Clustering reactions
C2H5O- + = C3H6F3O-
By formula: C2H5O- + CHF3 = C3H6F3O-
Quantity | Value | Units | Method | Reference | Comment |
---|---|---|---|---|---|
ΔrH° | 92.0 ± 4.2 | kJ/mol | IMRE | Chabinyc and Brauman, 1998 | gas phase |
Quantity | Value | Units | Method | Reference | Comment |
ΔrG° | 63.2 ± 4.2 | kJ/mol | IMRE | Chabinyc and Brauman, 1998 | gas phase |

Gas phase thermochemistry data

Data compiled by: John E. Bartmess
Quantity | Value | Units | Method | Reference | Comment |
---|---|---|---|---|---|
ΔfH°gas | -963.6 ± 6.3 | kJ/mol | Ther | Chabinyc and Brauman, 1998 |

References

Chabinyc and Brauman, 1998
Chabinyc, M.L.; Brauman, J.I.,
Acidity, basicity, and the stability of hydrogen bonds: Complexes of RO-+HCF3,
J. Am. Chem. Soc., 1998, 120, 42, 10863-10870, https://doi.org/10.1021/ja9817592
. [all data]