CF3H..MeO anion
- Formula: C2H4F3O-
- Molecular weight: 101.0483

Reaction thermochemistry data

Data compiled by: John E. Bartmess
Individual Reactions
CH3O- + = C2H4F3O-
By formula: CH3O- + CHF3 = C2H4F3O-
Quantity | Value | Units | Method | Reference | Comment |
---|---|---|---|---|---|
ΔrH° | 98.3 ± 4.2 | kJ/mol | IMRE | Chabinyc and Brauman, 1998 | gas phase |
Quantity | Value | Units | Method | Reference | Comment |
ΔrG° | 69.5 ± 4.2 | kJ/mol | IMRE | Chabinyc and Brauman, 1998 | gas phase |

Ion clustering data

Data compiled by: John E. Bartmess
Clustering reactions
CH3O- + = C2H4F3O-
By formula: CH3O- + CHF3 = C2H4F3O-
Quantity | Value | Units | Method | Reference | Comment |
---|---|---|---|---|---|
ΔrH° | 98.3 ± 4.2 | kJ/mol | IMRE | Chabinyc and Brauman, 1998 | gas phase |
Quantity | Value | Units | Method | Reference | Comment |
ΔrG° | 69.5 ± 4.2 | kJ/mol | IMRE | Chabinyc and Brauman, 1998 | gas phase |

Gas phase thermochemistry data

Data compiled by: John E. Bartmess
Quantity | Value | Units | Method | Reference | Comment |
---|---|---|---|---|---|
ΔfH°gas | -220.3 ± 1.2 | kcal/mol | Ther | Chabinyc and Brauman, 1998 |

References

Chabinyc and Brauman, 1998
Chabinyc, M.L.; Brauman, J.I.,
Acidity, basicity, and the stability of hydrogen bonds: Complexes of RO-+HCF3,
J. Am. Chem. Soc., 1998, 120, 42, 10863-10870, https://doi.org/10.1021/ja9817592
. [all data]