Ni(SC(CN)=C(CN)S)2 dianion

Gas phase ion energetics data

Data compiled by: John E. Bartmess

Electron affinity of neutral species

EAneutral (eV) Method Reference Comment
0.440 ± 0.040LPESWaters, Woo, et al., 2006Vertical Detachment Energy: 0.49±0.03 eV

References

Waters, Woo, et al., 2006
Waters, T.; Woo, H.K.; Wang, X.B.; Wang, L.S., Probing the intrinsic electronic structure of the bis(dithiolene) anions [M(mnt)(2)](2-) and [M(mnt)(2)](1-) (M = Ni, Pd, Pt; mnt=1,2-S2C2(CN)(2)) in the gas phase by photoelectron spectrosc, J. Am. Chem. Soc., 2006, 128, 13, 4282-4291, https://doi.org/10.1021/ja056342s . [all data]