(COS)4 radical anion

Gas phase ion energetics data

Data compiled by: John E. Bartmess

Electron affinity of neutral species

EAneutral (eV) Method Reference Comment
2.40 ± 0.10LPESSurber and Sanov, 2003Stated electron affinity is the Vertical Detachment Energy

References

Surber and Sanov, 2003
Surber, E.; Sanov, A., Photoelectron imaging of carbonyl sulfide cluster anions: Isomer coexistence and competition of excited-state decay mechanisms, J. Chem. Phys., 2003, 118, 20, 9192-9200, https://doi.org/10.1063/1.1569915 . [all data]