SO3..Br anion
- Formula: BrO3S-
- Molecular weight: 159.968

Ion clustering data

Data compiled by: John E. Bartmess
Clustering reactions
By formula: Br- + O3S = BrO3S-
Quantity | Value | Units | Method | Reference | Comment |
---|---|---|---|---|---|
ΔrH° | 179. ± 11. | kJ/mol | CIDT | Hao, Gilbert, et al., 2006 | gas phase |

References

Hao, Gilbert, et al., 2006
Hao, C.; Gilbert, T.M.; Sunderlin, L.S.,
The Bond Dissociation Energies of SO3-X- (X = F, Cl, Br, and I),
Can. J. Chem., 2006, 83, 11, 2013-2019, https://doi.org/10.1139/v05-216
. [all data]