CF3Br..Br anion
- Formula: CBr2F3-
- Molecular weight: 228.814

Reaction thermochemistry data

Data compiled by: John E. Bartmess
Individual Reactions
By formula: Br- + CBrF3 = CBr2F3-
Quantity | Value | Units | Method | Reference | Comment |
---|---|---|---|---|---|
ΔrH° | 58.16 ± 0.84 | kJ/mol | TDAs | Bogdanov and McMahon, 2006 | gas phase |
Quantity | Value | Units | Method | Reference | Comment |
ΔrG° | 30.5 | kJ/mol | TDAs | Bogdanov and McMahon, 2006 | gas phase |

Ion clustering data

Data compiled by: John E. Bartmess
Clustering reactions
By formula: Br- + CBrF3 = CBr2F3-
Quantity | Value | Units | Method | Reference | Comment |
---|---|---|---|---|---|
ΔrH° | 58.16 ± 0.84 | kJ/mol | TDAs | Bogdanov and McMahon, 2006 | gas phase |
Quantity | Value | Units | Method | Reference | Comment |
ΔrG° | 30.5 | kJ/mol | TDAs | Bogdanov and McMahon, 2006 | gas phase |

Gas phase thermochemistry data

Data compiled by: John E. Bartmess
Quantity | Value | Units | Method | Reference | Comment |
---|---|---|---|---|---|
ΔfH°gas | -920.6 ± 2.3 | kJ/mol | Ther | Bogdanov and McMahon, 2006 |

References

Bogdanov and McMahon, 2006
Bogdanov, B.; McMahon, T.B.,
Gas phase S(N)2 reactions of halide ions with trifluoromethyl halides: Front- and back-side attack vs. complex formation,
J. Phys. Chem. A, 2006, 110, 4, 1350-1363, https://doi.org/10.1021/jp0541011
. [all data]