CF3I..Cl anion
- Formula: CClF3I-
- Molecular weight: 231.364

Reaction thermochemistry data

Data compiled by: John E. Bartmess
Individual Reactions
By formula: Cl- + CF3I = CClF3I-
Quantity | Value | Units | Method | Reference | Comment |
---|---|---|---|---|---|
ΔrH° | 23.60 ± 0.20 | kcal/mol | TDAs | Bogdanov and McMahon, 2006 | gas phase |

Ion clustering data

Data compiled by: John E. Bartmess
Clustering reactions
By formula: Cl- + CF3I = CClF3I-
Quantity | Value | Units | Method | Reference | Comment |
---|---|---|---|---|---|
ΔrH° | 23.60 ± 0.20 | kcal/mol | TDAs | Bogdanov and McMahon, 2006 | gas phase |

Gas phase thermochemistry data

Data compiled by: John E. Bartmess

Quantity Value Units Method Reference Comment
Δfgas-915.25kJ/molTherBogdanov and McMahon, 2006

References

Bogdanov and McMahon, 2006
Bogdanov, B.; McMahon, T.B.,
Gas phase S(N)2 reactions of halide ions with trifluoromethyl halides: Front- and back-side attack vs. complex formation,
J. Phys. Chem. A, 2006, 110, 4, 1350-1363, https://doi.org/10.1021/jp0541011
. [all data]