CF3Br..Cl anion
- Formula: CBrClF3-
- Molecular weight: 184.363

Reaction thermochemistry data

Data compiled by: John E. Bartmess
Individual Reactions
By formula: Cl- + CBrF3 = CBrClF3-
Quantity | Value | Units | Method | Reference | Comment |
---|---|---|---|---|---|
ΔrH° | 16.50 ± 0.20 | kcal/mol | TDAs | Bogdanov and McMahon, 2006 | gas phase |
Quantity | Value | Units | Method | Reference | Comment |
ΔrG° | 9.20 | kcal/mol | TDAs | Bogdanov and McMahon, 2006 | gas phase |

Ion clustering data

Data compiled by: John E. Bartmess
Clustering reactions
By formula: Cl- + CBrF3 = CBrClF3-
Quantity | Value | Units | Method | Reference | Comment |
---|---|---|---|---|---|
ΔrH° | 16.50 ± 0.20 | kcal/mol | TDAs | Bogdanov and McMahon, 2006 | gas phase |
Quantity | Value | Units | Method | Reference | Comment |
ΔrG° | 9.20 | kcal/mol | TDAs | Bogdanov and McMahon, 2006 | gas phase |

Gas phase thermochemistry data

Data compiled by: John E. Bartmess
Quantity | Value | Units | Method | Reference | Comment |
---|---|---|---|---|---|
ΔfH°gas | -226.13 | kcal/mol | Ther | Bogdanov and McMahon, 2006 |

References

Bogdanov and McMahon, 2006
Bogdanov, B.; McMahon, T.B.,
Gas phase S(N)2 reactions of halide ions with trifluoromethyl halides: Front- and back-side attack vs. complex formation,
J. Phys. Chem. A, 2006, 110, 4, 1350-1363, https://doi.org/10.1021/jp0541011
. [all data]