(H2O)..{MeCO2H}3..MeCO2 anion
- Formula: C8H17O9-
- Molecular weight: 257.2157

Gas phase thermochemistry data

Data compiled by: John E. Bartmess
Quantity | Value | Units | Method | Reference | Comment |
---|---|---|---|---|---|
ΔfH°gas | -2338. ± 15. | kJ/mol | Ther | Meot-ner, Elmore, et al., 1999 |

Reaction thermochemistry data

Data compiled by: John E. Bartmess
Individual Reactions
C8H15O8- + 3 +
= C8H17O9-
By formula: C8H15O8- + 3H2O + H2O = C8H17O9-
Quantity | Value | Units | Method | Reference | Comment |
---|---|---|---|---|---|
ΔrH° | 37. ± 4.2 | kJ/mol | N/A | Meot-ner, Elmore, et al., 1999 | gas phase |
Quantity | Value | Units | Method | Reference | Comment |
ΔrG° | 2.7 | kJ/mol | TDAs | Meot-ner, Elmore, et al., 1999 | gas phase |

Ion clustering data

Data compiled by: John E. Bartmess
Clustering reactions
C8H15O8- + 3 +
= C8H17O9-
By formula: C8H15O8- + 3H2O + H2O = C8H17O9-
Quantity | Value | Units | Method | Reference | Comment |
---|---|---|---|---|---|
ΔrH° | 37. ± 4.2 | kJ/mol | N/A | Meot-ner, Elmore, et al., 1999 | gas phase |
Quantity | Value | Units | Method | Reference | Comment |
ΔrG° | 2.7 | kJ/mol | TDAs | Meot-ner, Elmore, et al., 1999 | gas phase |

References

Meot-ner, Elmore, et al., 1999
Meot-ner, M.; Elmore, D.E.; Scheiner, S.,
Ionic Hydrogen Bond Effects on the Acidities, Basicities, Solvation, Solvent Bridging and Self-assembly of Carboxylic Groups,
J. Am. Chem. Soc., 1999, 121, 33, 7625, https://doi.org/10.1021/ja982173i
. [all data]