(H2O)2..{MeCO2H}2..MeCO2 anion
- Formula: C6H15O8-
- Molecular weight: 215.1790

Gas phase thermochemistry data

Data compiled by: John E. Bartmess
Quantity | Value | Units | Method | Reference | Comment |
---|---|---|---|---|---|
ΔfH°gas | -2129. ± 14. | kJ/mol | Ther | Meot-ner, Elmore, et al., 1999 |

Ion clustering data

Data compiled by: John E. Bartmess
Clustering reactions
C6H13O7- + 2 + 2
= C6H15O8-
By formula: C6H13O7- + 2H2O + 2H2O = C6H15O8-
Quantity | Value | Units | Method | Reference | Comment |
---|---|---|---|---|---|
ΔrH° | 33.9 ± 0.42 | kJ/mol | N/A | Meot-ner, Elmore, et al., 1999 | gas phase |
Quantity | Value | Units | Method | Reference | Comment |
ΔrG° | 9.83 | kJ/mol | TDAs | Meot-ner, Elmore, et al., 1999 | gas phase |

Reaction thermochemistry data

Data compiled by: John E. Bartmess

Individual Reactions

C6H13O7- + 2Water + 2Water = C6H15O8-

By formula: C6H13O7- + 2H2O + 2H2O = C6H15O8-

Quantity Value Units Method Reference Comment
Δr33.9 ± 0.42kJ/molN/AMeot-ner, Elmore, et al., 1999gas phase
Quantity Value Units Method Reference Comment
Δr9.83kJ/molTDAsMeot-ner, Elmore, et al., 1999gas phase

References

Meot-ner, Elmore, et al., 1999
Meot-ner, M.; Elmore, D.E.; Scheiner, S.,
Ionic Hydrogen Bond Effects on the Acidities, Basicities, Solvation, Solvent Bridging and Self-assembly of Carboxylic Groups,
J. Am. Chem. Soc., 1999, 121, 33, 7625, https://doi.org/10.1021/ja982173i
. [all data]