H2O..{MeCO2H}2..MeCO2 anion
- Formula: C6H13O7-
- Molecular weight: 197.1638

Gas phase thermochemistry data

Data compiled by: John E. Bartmess
Quantity | Value | Units | Method | Reference | Comment |
---|---|---|---|---|---|
ΔfH°gas | -1854. ± 14. | kJ/mol | Ther | Meot-ner, Elmore, et al., 1999 |

Reaction thermochemistry data

Data compiled by: John E. Bartmess
Individual Reactions
C6H11O6- + 2 + 2
= C6H13O7-
By formula: C6H11O6- + 2H2O + 2H2O = C6H13O7-
Quantity | Value | Units | Method | Reference | Comment |
---|---|---|---|---|---|
ΔrH° | 38.1 ± 1.7 | kJ/mol | N/A | Meot-ner, Elmore, et al., 1999 | gas phase |
Quantity | Value | Units | Method | Reference | Comment |
ΔrG° | 11.6 | kJ/mol | TDAs | Meot-ner, Elmore, et al., 1999 | gas phase |
C6H13O7- + 2 + 2
= C6H15O8-
By formula: C6H13O7- + 2H2O + 2H2O = C6H15O8-
Quantity | Value | Units | Method | Reference | Comment |
---|---|---|---|---|---|
ΔrH° | 33.9 ± 0.42 | kJ/mol | N/A | Meot-ner, Elmore, et al., 1999 | gas phase |
Quantity | Value | Units | Method | Reference | Comment |
ΔrG° | 9.83 | kJ/mol | TDAs | Meot-ner, Elmore, et al., 1999 | gas phase |

Ion clustering data

Data compiled by: John E. Bartmess
Clustering reactions
C6H11O6- + 2 + 2
= C6H13O7-
By formula: C6H11O6- + 2H2O + 2H2O = C6H13O7-
Quantity | Value | Units | Method | Reference | Comment |
---|---|---|---|---|---|
ΔrH° | 38.1 ± 1.7 | kJ/mol | N/A | Meot-ner, Elmore, et al., 1999 | gas phase |
Quantity | Value | Units | Method | Reference | Comment |
ΔrG° | 11.6 | kJ/mol | TDAs | Meot-ner, Elmore, et al., 1999 | gas phase |
C6H13O7- + 2 + 2
= C6H15O8-
By formula: C6H13O7- + 2H2O + 2H2O = C6H15O8-
Quantity | Value | Units | Method | Reference | Comment |
---|---|---|---|---|---|
ΔrH° | 33.9 ± 0.42 | kJ/mol | N/A | Meot-ner, Elmore, et al., 1999 | gas phase |
Quantity | Value | Units | Method | Reference | Comment |
ΔrG° | 9.83 | kJ/mol | TDAs | Meot-ner, Elmore, et al., 1999 | gas phase |

References

Meot-ner, Elmore, et al., 1999
Meot-ner, M.; Elmore, D.E.; Scheiner, S.,
Ionic Hydrogen Bond Effects on the Acidities, Basicities, Solvation, Solvent Bridging and Self-assembly of Carboxylic Groups,
J. Am. Chem. Soc., 1999, 121, 33, 7625, https://doi.org/10.1021/ja982173i
. [all data]