(H2O)3..{MeCO2H}..MeCO2 anion
- Formula: C4H13O7-
- Molecular weight: 173.1424

Gas phase thermochemistry data

Data compiled by: John E. Bartmess
Quantity | Value | Units | Method | Reference | Comment |
---|---|---|---|---|---|
ΔfH°gas | -1926. ± 15. | kJ/mol | Ther | Meot-ner, Elmore, et al., 1999 |

Reaction thermochemistry data

Data compiled by: John E. Bartmess
Individual Reactions
C4H11O6- + + 3
= C4H13O7-
By formula: C4H11O6- + H2O + 3H2O = C4H13O7-
Quantity | Value | Units | Method | Reference | Comment |
---|---|---|---|---|---|
ΔrH° | 46.0 ± 4.2 | kJ/mol | N/A | Meot-ner, Elmore, et al., 1999 | gas phase |
Quantity | Value | Units | Method | Reference | Comment |
ΔrG° | 18.6 | kJ/mol | TDAs | Meot-ner, Elmore, et al., 1999 | gas phase |

Ion clustering data

Data compiled by: John E. Bartmess
Clustering reactions
C4H11O6- + + 3
= C4H13O7-
By formula: C4H11O6- + H2O + 3H2O = C4H13O7-
Quantity | Value | Units | Method | Reference | Comment |
---|---|---|---|---|---|
ΔrH° | 46.0 ± 4.2 | kJ/mol | N/A | Meot-ner, Elmore, et al., 1999 | gas phase |
Quantity | Value | Units | Method | Reference | Comment |
ΔrG° | 18.6 | kJ/mol | TDAs | Meot-ner, Elmore, et al., 1999 | gas phase |

References

Meot-ner, Elmore, et al., 1999
Meot-ner, M.; Elmore, D.E.; Scheiner, S.,
Ionic Hydrogen Bond Effects on the Acidities, Basicities, Solvation, Solvent Bridging and Self-assembly of Carboxylic Groups,
J. Am. Chem. Soc., 1999, 121, 33, 7625, https://doi.org/10.1021/ja982173i
. [all data]