Nd anion

Gas phase ion energetics data

Data compiled by: John E. Bartmess

Electron affinity of neutral species

EAneutral (eV) Method Reference Comment
>1.916 ± 0.020LPESDavis, Thompson, et al., 2005

References

Davis, Thompson, et al., 2005
Davis, V.T.; Thompson, J.; Covington, A., Laser photodetachment electron spectroscopy studies of heavy atomic anions, Nucl. Instrum. Meth. Phys. Res. B, 2005, 241, 1-4, 118-124, https://doi.org/10.1016/j.nimb.2005.07.073 . [all data]