HfO2 anion

Gas phase ion energetics data

Data compiled by: John E. Bartmess

Electron affinity of neutral species

EAneutral (eV) Method Reference Comment
2.10450 ± 0.00050N/AKim, Weichman, et al., 2013
2.140 ± 0.030LPESZheng, Bowen, et al., 2005

References

Kim, Weichman, et al., 2013
Kim, J.B.; Weichman, M.L.; Neumark, D.M., High-resolution anion photoelectron spectra of TiO2-, ZrO2-, and HfO2- obtained by slow electron velocity- map imaging, Phys. Chem. Chem. Phys., 2013, 15, 48, 20973-20981, https://doi.org/10.1039/c3cp54084g . [all data]

Zheng, Bowen, et al., 2005
Zheng, W.J.; Bowen, K.H.; Li, J.; Dabkowska, I.; Gutowski, M., Electronic structure differences in ZrO2 vs HfO2, J. Phys. Chem. A, 2005, 109, 50, 11521-11525, https://doi.org/10.1021/jp053593e . [all data]