[(H2O)4..GlyGly-H]) anion

Reaction thermochemistry data

Data compiled by: John E. Bartmess

Individual Reactions

CAS Reg. No. 23372-53-4 + 4Water = C4H15N2O7-

By formula: CAS Reg. No. 23372-53-4 + 4H2O = C4H15N2O7-

Quantity Value Units Method Reference Comment
Δr31.0 ± 0.42kJ/molTDEqLiu, Wyttenbacj, et al., 2004gas phase
Quantity Value Units Method Reference Comment
Δr13.9kJ/molTDEqLiu, Wyttenbacj, et al., 2004gas phase

References

Liu, Wyttenbacj, et al., 2004
Liu, D.; Wyttenbacj, T.; Carpenter, C.J.; Bowers, M.T., Investigation of Non-Covalent Interactions in Deprotonated Peptides: Structural and Energetic Competition between Aggregation and Hydration, J. Am. Chem. Soc., 2004, 126, 10, 3261, https://doi.org/10.1021/ja0393628 . [all data]