CF3CF2CH2OH..uracil radical anion

Gas phase ion energetics data

Data compiled by: John E. Bartmess

Electron affinity of neutral species

EAneutral (eV) Method Reference Comment
1.30 ± 0.10LPESHaranczyk, Rak, et al., 2005Stated electron affinity is the Vertical Detachment Energy

References

Haranczyk, Rak, et al., 2005
Haranczyk, M.; Rak, J.; Gutowski, M.; Radisic, D.; Stokes, S.T.; Bowen, K.H., Intermolecular proton transfer in anionic complexes of uracil with alcohols, J. Phys. Chem. B, 2005, 109, 27, 13383-13391, https://doi.org/10.1021/jp050246w . [all data]