CrWO7 dianion

Gas phase ion energetics data

Data compiled by: John E. Bartmess

Electron affinity of neutral species

EAneutral (eV) Method Reference Comment
1.640 ± 0.070LPESZhai, Huang, et al., 2005Vertical Detachment Energy: 1.94±0.04 eV.

References

Zhai, Huang, et al., 2005
Zhai, H.J.; Huang, X.; Waters, T.; Wang, X.B.; O'Hair, R.A.J.; Wedd, A.G.; Wang, L.S., Photoelectron spectroscopy of doubly and singly charged group VIB dimetalate anions: M2O72-, MM ' O-7(2-), and M2O7- (M, M ' = Cr, Mo, W), J. Phys. Chem. A, 2005, 109, 46, 10512-10520, https://doi.org/10.1021/jp055122y . [all data]