AlH4 anion
- Formula: AlH4-
- Molecular weight: 31.01385

Reaction thermochemistry data

Data compiled by: John E. Bartmess
Individual Reactions
Quantity | Value | Units | Method | Reference | Comment |
---|---|---|---|---|---|
ΔrH° | 314. ± 17. | kJ/mol | CIDT | Goebbert, Hernandez, et al., 2005 | gas phase |

Ion clustering data

Data compiled by: John E. Bartmess
Clustering reactions
Quantity | Value | Units | Method | Reference | Comment |
---|---|---|---|---|---|
ΔrH° | 314. ± 17. | kJ/mol | CIDT | Goebbert, Hernandez, et al., 2005 | gas phase |

Gas phase thermochemistry data

Data compiled by: John E. Bartmess
Quantity | Value | Units | Method | Reference | Comment |
---|---|---|---|---|---|
ΔfH°gas | -39.7 | kJ/mol | Ther | Goebbert, Hernandez, et al., 2005 |

References

Goebbert, Hernandez, et al., 2005
Goebbert, D.J.; Hernandez, H.; Francisco, J.S.; Wenthold, P.G.,
The binding energy and bonding in dialane,
J. Am. Chem. Soc., 2005, 127, 33, 11684-11689, https://doi.org/10.1021/ja0424070
. [all data]