Me2N anion

Reaction thermochemistry data

Data compiled by: John E. Bartmess

Individual Reactions

C2H6N- + Hydrogen cation = Dimethylamine

By formula: C2H6N- + H+ = C2H7N

Quantity Value Units Method Reference Comment
Δr1653. ± 8.4kJ/molD-EARadisic, Xu, et al., 2002gas phase; BDE supported by 72GOL/SOL, over McMillen and Golden, 1982
Δr1658.7 ± 3.7kJ/molG+TSMacKay, Hemsworth, et al., 1976gas phase
Quantity Value Units Method Reference Comment
Δr1623. ± 8.8kJ/molH-TSRadisic, Xu, et al., 2002gas phase; BDE supported by 72GOL/SOL, over McMillen and Golden, 1982
Δr1628.4 ± 2.5kJ/molIMREMacKay, Hemsworth, et al., 1976gas phase

References

Radisic, Xu, et al., 2002
Radisic, D.; Xu, S.J.; Bowen, K.H., Photoelectron spectroscopy of the anions, CH3NH- and (CH3)(2)N- and the anion complexes, H-(CH3NH2) and (CH3)(2)N-[(CH3)(2)NH), Chem. Phys. Lett., 2002, 354, 1-2, 9-13, https://doi.org/10.1016/S0009-2614(01)01470-1 . [all data]

McMillen and Golden, 1982
McMillen, D.F.; Golden, D.M., Hydrocarbon bond dissociation energies, Ann. Rev. Phys. Chem., 1982, 33, 493. [all data]

MacKay, Hemsworth, et al., 1976
MacKay, G.J.; Hemsworth, R.S.; Bohme, D.K., Absolute gas-phase acidities of CH3NH2, C2H5NH2, (CH3)2NH, and (CH3)3N, Can. J. Chem., 1976, 54, 1624. [all data]