cycloheptanide anion
- Formula: C7H13-
- Molecular weight: 97.1787

Reaction thermochemistry data

Data compiled by: John E. Bartmess
Individual Reactions
By formula: C7H13- + H+ = C7H14
Quantity | Value | Units | Method | Reference | Comment |
---|---|---|---|---|---|
ΔrH° | 1739. ± 20. | kJ/mol | Bran | Peerboom, Rademaker, et al., 1992 | gas phase |
Quantity | Value | Units | Method | Reference | Comment |
ΔrG° | 1702. ± 21. | kJ/mol | H-TS | Peerboom, Rademaker, et al., 1992 | gas phase |

Gas phase ion energetics data

Data compiled by: John E. Bartmess
Electron affinity of neutral species
EAneutral (eV) | Method | Reference | Comment |
---|---|---|---|
-0.16 ± 0.21 | D-EA | Peerboom, Rademaker, et al., 1992 |
Protonation reactions
By formula: C7H13- + H+ = C7H14
Quantity | Value | Units | Method | Reference | Comment |
---|---|---|---|---|---|
ΔrH° | 1739. ± 20. | kJ/mol | Bran | Peerboom, Rademaker, et al., 1992 | gas phase |
Quantity | Value | Units | Method | Reference | Comment |
ΔrG° | 1702. ± 21. | kJ/mol | H-TS | Peerboom, Rademaker, et al., 1992 | gas phase |

References

Peerboom, Rademaker, et al., 1992
Peerboom, R.A.L.; Rademaker, G.J.; Dekoning, L.J.; Nibbering, N.M.M.,
Stabilization of Cycloalkyl Carbanions in the Gas Phase,
Rapid Commun. Mass Spectrom., 1992, 6, 6, 394, https://doi.org/10.1002/rcm.1290060608
. [all data]