Al20N radical anion

Gas phase ion energetics data

Data compiled by: John E. Bartmess

Electron affinity of neutral species

EAneutral (eV) Method Reference Comment
3.1500 ± 0.0043LPESLi and Wang, 2005

References

Li and Wang, 2005
Li, X.; Wang, L.S., Probing the electronic structure of mono-nitrogen doped aluminum clusters using anion photoelectron spectroscopy, Eur. Phys. J. D, 2005, 34, 1-3, 9-14, https://doi.org/10.1140/epjd/e2005-00100-3 . [all data]