nPrNH anion
- Formula: C3H8N-
- Molecular weight: 58.1029

Gas phase ion energetics data

Data compiled by: John E. Bartmess
Electron affinity of neutral species
EAneutral (eV) | Method | Reference | Comment |
---|---|---|---|
0.70 ± 0.19 | D-EA | Brauman and Blair, 1971 |
Protonation reactions
By formula: C3H8N- + H+ = C3H9N
Quantity | Value | Units | Method | Reference | Comment |
---|---|---|---|---|---|
ΔrH° | 1667. ± 13. | kJ/mol | G+TS | Brauman and Blair, 1971 | gas phase |
Quantity | Value | Units | Method | Reference | Comment |
ΔrG° | 1636. ± 13. | kJ/mol | IMRB | Brauman and Blair, 1971 | gas phase |

References

Brauman and Blair, 1971
Brauman, J.I.; Blair, L.K.,
Gas phase acidities of amines,
J. Am. Chem. Soc., 1971, 93, 3911. [all data]